,,T1,T2,T3,T4,T5,T6,T7,T8,T9,T10,T11,T12,T13,T14,T15,T16
,,Halitosis,Body odor,Body odor,Body odor,Halitosis,Body odor,Halitosis,Body odor,Body odor,Body odor and Halitosis,Body odor and Halitosis,Body odor suspected,Body odor,"Body odor, started to have Halitosis after anti-candida treatment",,Halitosis
Mid- and lower Gastrointestinal issues,,No issues,Constipation,Constipation/Bloating,Diarrhea,Alternating/Bloating,Constipation,"No issues, but used to have IBS",Constipation,No issues,No issues,No issues,Constipation,Undigested food in stools. ,"Constipation makes odor worse (used to have Diarrhea); Bloating, Gas, Pale coloured stools, Stomach or lower abdominal pain, Undigested food in stool when consumed too much fructose. IBS symptoms. ",Undigested fiber in stools,No issues
Upper GI issues,,No issues,No issues,GERD,No issues,No issues,GERD,No issues,No issues,No issues,No issues,No issues,No issues,No issues,No issues,No issues,No issues
Skin,,"psoriasis, eczema, dermatitis",athletes foot,"psoriasis, eczema, dermatitis, rosacea etc",psoriasis,,,,Eczema,"Eczema, athletes foot,", oily skin,no complaints,athletes foot,,acne,,
Odors in own words,,fecal,"garbage/sewage, sulphur,  rotten cabbage, damp/dirty",sweaty and anal/groinal,fecal diarrheal?,rotten eggs to sewage to smoke like and burning ,Ammonia,rotten & chemical smells,sulphur,poo,"Ammonia, fecal, smoke, garbage","Fish, garbage",PATM can't describe (allergic reactions to others),"fecal, gas, undefined",Fecal body odor for 2 years. Mostly can�t smell it. Others tell her. (anal?),chemical,?
TMAU,,not tested,Negative (including DNA test),not tested,not tested,Negative,not tested,not tested,not tested,not tested,Positive: Secondary,Negative,Negative,,?,,?
Probiotics,,neutral,not taking,better,neutral,cause fecal odor,neutral,better,don�t know,worse; but Greek yogurt works,,did not have any in the last 6 month,better,neutral,neutral,neutral,neutral
Low-choline diet,,,,,,more fecal odor,,,,,,,,,,,
Dairy,,,,,,rancid butter/cheesy/sweaty after eating cottage cheese (IBS),,,,"milk, cheese",,,,,,,
Odor raises with Protein,,,Yes,,Yes - potential cause: protein overload,Yes,,,,beef,,,,,,,
Odor raises with Carbs,,,,,"Yes; highly refined foods like: white flours, white rice, mashed potatoes, starchy and sugary foods",Sugar - elimination helps,,,Peanut allergy,Chocolate,,,,,"Fructose, possibly",,
Odor raises with Alcohol,,,,,Beer,,Yes,,,Beer,,,,,,,
Vegetables,,,,,,,,problems digesting vegetables; especially sulfurous,,,,,,,,,
Odor worse with,,,,stress; potential cause: psychological,,,"raining (humidity), stomach pain, not enough sleep",stress and sulfur foods provoke the problem,"stress, adrenalin","milk, cheese and beef are possible triggers.",,sexual activity,,fatigue?,"stress, fructose, constipation",,
Craving simple carbohydrates,,Don't know,Yes,separates garbage best,Yes,Yes,Yes,sometimes,Yes,Yes,Don't know,,Don't know,Yes,Yes,?,
feeling unwell,,,,Yes,Yes,,Yes,no,"not physically, but low emotionally",no,,,,,,,
allergies,,,,celiac,,,,,peanuts,,,,,,,,"suspected, but no IgE detected"
TEST RESULTS,REFERENCE RANGE,,,,,,,,,,,,,,,,
Ethanol,<22,0,140,66,4,134,22,69,120,0,0,4,134,0,140,18,75
,<0.1 mg/dl,<0.1,0.6,0.3,<0.1,0.6,0.1,0.3,0.6,<0.1,<0.1,<0.1,0.6,0,0.6,<0.1,0.3
,,0,0.6,0.3,0,0.6,0.1,0.3,0.6,0,0,0,0.6,0,0.6,0,0.3
Methanol,<2.5,N.D.,0.4,0.2,1.5,N.D.,0.2,1.5,N.D.,0.3,N.D.,0.8,0.2,N.D. (<0.1),1.1,0.8,1.4
2-propanol,<1.0,1.2,1.3,0.7,0.5,0.8,0.8,0.9,0.8,0.9,0.5,0.5,0.6,1.2,0.6,0.4,1.3
1-propanol,<0.5,0.3,0.5,1.6,0,2.3,1,2.2,0.7,1.9,0.4,0,1,0.2,0.5,0.5,1.3
2-methyl-2-propanol,<0.3,N.D.,N.D.,N.D.,N.D.,N.D.,N.D.,N.D.,N.D.,N.D.,N.D.,N.D.,N.D.,N.D.,N.D.,N.D.,0.3
2-methyl-1-propanol,<0.3,N.D.,1,N.D.,2.4,N.D.,N.D.,0.5,N.D.,N.D.,1.4,0.3,N.D.,0.2,2.4,0.5,1.2
,,,|||,,,,,,,,,|||,,,,,
2-butanol,<2.3,1.2,4,1.2,1.9,0.5,1.7,1.9,1.1,0.4,0,2.3,1.4,1.9,0.5,2.1,0
1-butanol,<1.2,N.D.,0.2,0.8,0.4,N.D.,0.6,1,1,4.1,0.3,0.5,0.2,N.D.,N.D.,0.7,0.6
2-methyl-2-butanol,<0.5,N.D.,N.D.,N.D.,N.D.,N.D.,N.D.,N.D.,N.D.,N.D.,N.D.,N.D.,N.D.,N.D.,N.D.,N.D.,N.D.
2-methyl-1-butanol,<0.3,N.D.,N.D.,0.3,0.5,N.D.,N.D.,0.5,N.D.,N.D.,0.5,0.5,N.D.,0.5,0.4,N.D.,N.D.
2-ethyl-1-butanol,<1.0,0.5,0.4,0.4,0.8,0.6,0.8,N.D.,1.2,0.4,0.3,1,0.3,0.2,0.6,0.4,5
"2,3-butylene glycol",<2.5,2.2,6,1.4,1,1.9,2.4,4.7,0.5,2.4,4.7,6,0.7,1.3,0.5,4.5,1.8
,,,,,,,,,,,,,,,,,
SHORT CHAIN FATTY ACIDS AND RELATED SUBSTANCES,,,,,,,,,,,,,,,,,
Acetate,52-85,62,29,79,71,90,32,68,21,83,70,82,67,47,82,59,74
Propionate,10-56,27,9,40,39,12,7,13,12,9,22,30,38,4,30,11,13
Butyrate,7-33,11,2,14,13,7,1,8,13,0,10,11,13,0,11,0,8
Succinate,1-31,9,6,4,11,14,8,2,15,4,6,5,2,6,6,12,10
Valerate,2-19,6,4,7,5,6,7,14,11,4,9,3,7,14,5,13,15
D-lactate (plasma),<60 umol/L NOTE that Biolab raised their normal to <100 in 2009 (after T11),8,156,2,3,4,8,,15,16,2,503,96,N/A,30,5,N/A
Indicans (urine),,Negative,Negative,Positive,Negative,Negative,Negative,Positive,Positive,Negative,Negative,Positive,Negative,Positive,Positive,weak positive,Negative
Hydrogen/Methane Breath Test,,normal - lactose intolerance test,,,,normal - no sign increases in H2 and CH4 for the duration of the test after ingestion of the lactulose dose,,,,,,,,,,Raised hydrogen and methane (high fasting),normal
Functional Blood B Vitamins,,,,,,,,,,,,,,,,,
B2 (EGR activation),"1.2-1.3 bord (< normal, > deficient)",,,1.47,,1.81,,,1.56,1.35,1.09,1.11,1.23,,1.58,,
Intestinal permeability test,,,,,,,,,,,,,,,,,
PEG198,4-25; 13-30,7.7,12.1,10.7,12.1,11.3,18,11.6,,23.6,16.9,20.5,13.1,11.1,9.7,,3.3
PEG242,13-39,15.1,15.5,17.7,24.1,16,75,18.8,,43,25.2,42.1,32.9,16.5,15.4,,7
PEG286,15-32,10,22.1,24,30.3,18.6,29.4,24.2,,30.6,31.1,40.9,35.6,17.4,15.1,,9.4
PEG330,15-35,12.8,29.3,32.1,39.8,23,32.8,26.4,,36.5,36.3,43.2,43.7,20.7,16.5,,12.8
PEG374,14-35,14,34.9,36.7,46.1,26.8,34.4,26.5,,39.9,37.6,45.9,49.1,22.5,20.4,,15.6
PEG418,14-35,12.1,34.1,36.3,42.4,27.7,28.6,23.1,,36.2,34.3,44.9,49.7,21.4,19.7,,15.5
PEG462,12.5-35,15.1,35.5,37.8,46.7,29.5,27.4,21.5,,37.9,32.6,50.9,55.8,22.8,20.3,,17.2
PEG506,10-35,17.1,24.9,36.5,46,30.4,27.9,19.9,,36,29.7,52.9,58,22.2,19.3,,17.1
PEG550,5-35,17.9,31.5,36.8,38.7,31.1,21.7,14.9,,33,22,46.7,55.6,20.1,17.9,,16.1
PEG594,2-35,18,28.2,41.2,28.7,33.8,21.7,13.3,,29.1,7.5,26.6,52.6,19,15.5,,14.2
PEG638,1-35,17.8,22.4,41.2,0.1,34.8,17.3,11.1,,20.4,9.3,27.7,42.6,17,12.9,,12.6
