*Heading
** Job name: Job-1 Model name: MASTER
** Generated by: Abaqus/CAE 6.13-3
*INCLUDE, INPUT=NODES.inp
*Nset, nset=B
*Nset, nset=C
*Nset, nset=D
*Nset, nset=A
*Nset, nset=BOTTOM
*Elset, elset=BOTTOM, generate
*Nset, nset=RIGHT
*Elset, elset=RIGHT
*Nset, nset=TOP
*Elset, elset=TOP, generate
*Nset, nset=LEFT
*Elset, elset=LEFT
*Nset, nset=IMP
*Elset, elset=IMP, generate
*Nset, nset=REST, generate
*Elset, elset=REST
** Section: Section-1-REST
*Shell Section, elset=REST, material=MATERIAL-1, section integration=GAUSS
0.003, 3
** Section: Section-2-IMP
*Shell Section, elset=IMP, material=MATERIAL-1, section integration=GAUSS
0.00294, 3
**
*ELSET, ELSET=ONSET
*ELSET, ELSET=AWAY
**
**
*Node, nset=DNORM
*Node, nset=DSHEAR
*Element, type=MASS, elset=DNORM_Inertia-1_
*Mass, elset=DNORM_Inertia-1_
70.,
*Element, type=MASS, elset=DSHEAR_Inertia-1_
*Mass, elset=DSHEAR_Inertia-1_
70.,
*Equation
B, 1, 1., DNORM, 1, -1.
C, 1, 1., DNORM, 1, -1., DSHEAR, 1, -1.
D, 1, 1., DSHEAR, 1, -1.
*Equation
B, 2, 1., DSHEAR, 2, -1.
C, 2, 1., DSHEAR, 2, -1., DNORM, 2, -1.
D, 2, 1., DNORM, 2, -1.
*INCLUDE, INPUT=Equation.inp
**
** MATERIALS
**
*Material, name=MATERIAL-1
*Damage Initiation, criterion=DUCTILE
 1.55,0.,0.
*Damage Evolution, type=DISPLACEMENT
0.,
*Density
7850.,
*Elastic
 2e+11, 0.3
*Plastic
275.00e+06, 0.000
275.00e+06, 0.008
275.00e+06, 0.010
275.00e+06, 0.012
277.93e+06, 0.013
280.75e+06, 0.014
283.47e+06, 0.015
286.09e+06, 0.016
** ----------------------------------------------------------------
**
** STEP: Step-1
**
*Step, name=Step-1, nlgeom=YES,Inc=10000000
*Static
0.0001, 1.6, 1.0E-12, 1.6
** BOUNDARY CONDITIONS
**
** Name: Disp-BC-1 Type: Displacement/Rotation
*Boundary, user
DNORM, 1, 1
DNORM, 2, 2
*Boundary, user
DSHEAR, 1, 1
DSHEAR,2,2
*Boundary
A, 1, 1
A, 2, 2
**
** OUTPUT REQUESTS
**
** FIELD OUTPUT: F-Output-1
**
*Output, field
*Node Output
A, RF, U, V
**
** FIELD OUTPUT: F-Output-2
**
*Element Output, directions=YES
LE, MISES, PE, PEEQ, S, SDV, STATUS, TRIAX
**
** HISTORY OUTPUT: H-Output-1
**
*Output, history, time interval=0.01
*ELEMENT OUTPUT, ELSET=ONSET
PRESS, MISES, PEEQ, TRIAX
*ELEMENT OUTPUT, ELSET=AWAY
PRESS, MISES, PEEQ, TRIAX
*Output, history, variable=PRESELECT
*End Step