*Heading
** Job name: V_O_Sphere Model name: V_O_Sphere
** Generated by: Abaqus/CAE 6.14-5
*Preprint, echo=NO, model=NO, history=NO, contact=NO
**
** PARTS
**
*Part, name=Part-1
*Node
*Element, type=S4R5
*Nset, nset=surface, generate
*Elset, elset=surface, generate
*Nset, nset=bottom_line, generate
*Elset, elset=bottom_line, generate
*Nset, nset=top_line, generate
*Elset, elset=top_line, generate
*Nset, nset=side_lines
*Elset, elset=side_lines
*Nset, nset=OrientationEdge, generate
*Elset, elset=OrientationEdge, generate
*Elset, elset=_pressure_E2, internal, generate
*Surface, type=ELEMENT, name=pressure
_pressure_E2, E2
*Elset, elset=_Surf-2_SPOS, internal, generate
*Surface, type=ELEMENT, name=Surf-2
_Surf-2_SPOS, SPOS
*Elset, elset=_Surf-3_SPOS, internal, generate
*Surface, type=ELEMENT, name=Surf-3
_Surf-3_SPOS, SPOS
*Distribution, name=Ori-1-DiscOrient, location=ELEMENT, Table=Ori-1-DiscOrient_Table
** Description: Distribution generated from Discrete Orientation
*Orientation, name=Ori-1, system=RECTANGULAR
Ori-1-DiscOrient
** Region: (CompositeLayup-1-1: Generated From Layup)
*Elset, elset=CompositeLayup-1-1, generate
** Section: CompositeLayup-1-1
*Shell Section, elset=CompositeLayup-1-1, composite, orientation=Ori-1, layup=CompositeLayup-1
0.625, 3, unidirectionalGF, 0., Ply-1
0.625, 3, unidirectionalGF, 0., Ply-2
0.625, 3, unidirectionalGF, 0., Ply-3
0.625, 3, unidirectionalGF, 0., Ply-4
*End Part
**
**
** ASSEMBLY
**
*Assembly, name=Assembly
**
*Instance, name=Part-1-1, part=Part-1
*End Instance
**
*Nset, nset=_T-Part-1-1-spherical_csys, internal
Part-1-1.bottom_line,
Part-1-1.side_lines,
Part-1-1.top_line,
*Transform, nset=_T-Part-1-1-spherical_csys, type=S
*End Assembly
*Distribution Table, name=Ori-1-DiscOrient_Table
coord3D, coord3D
**
** MATERIALS
**
*Material, name=unidirectionalGF
*Density
 1.58e-06,
*Elastic, type=ENGINEERING CONSTANTS
26000.,4400.,4400., 0.26, 0.26, 0.26,1480.,1480.
1480.,
** ----------------------------------------------------------------
**
** STEP: Step-1
**
*Step, name=Step-1, nlgeom=NO, perturbation
*Frequency, eigensolver=Lanczos, acoustic coupling=on, normalization=displacement
3, , , , ,
**
** BOUNDARY CONDITIONS
**
** Name: BC-bottom Type: Displacement/Rotation
*Boundary
Part-1-1.bottom_line, 1, 1
Part-1-1.bottom_line, 2, 2
Part-1-1.bottom_line, 3, 3
Part-1-1.bottom_line, 4, 4
Part-1-1.bottom_line, 5, 5
Part-1-1.bottom_line, 6, 6
** Name: BC-sides Type: Displacement/Rotation
*Boundary
Part-1-1.side_lines, 1, 1
Part-1-1.side_lines, 2, 2
** Name: BC-top Type: Displacement/Rotation
*Boundary
Part-1-1.top_line, 1, 1
Part-1-1.top_line, 2, 2
Part-1-1.top_line, 3, 3
Part-1-1.top_line, 4, 4
Part-1-1.top_line, 5, 5
Part-1-1.top_line, 6, 6
**
** OUTPUT REQUESTS
**
*Restart, write, frequency=0
**
** FIELD OUTPUT: F-Output-1
**
*Output, field, variable=PRESELECT
*End Step