*Heading
** Job name: TENSIONe001-New Model name: Tension
** Generated by: Abaqus/CAE 6.14-4
*Preprint, echo=NO, model=NO, history=NO, contact=NO
**
** PARTS
**
*Part, name=Part-1
*Node
*Element, type=CAX4RT
*Nset, nset=Set-243, generate
*Elset, elset=Set-243, generate
*Nset, nset=Set-244, generate
*Elset, elset=Set-244, generate
*Elset, elset=Heat, generate
*Nset, nset=diaRed
*Elset, elset=stressOut
** Section: Section-1
*Solid Section, elset=Set-244, controls=EC-1, material=Material-1
*End Part
**
**
** ASSEMBLY
**
*Assembly, name=Assembly
**
*Instance, name=Part-1-1, part=Part-1
*End Instance
**
*Nset, nset=DiaRed, instance=Part-1-1
*Nset, nset=Force, instance=Part-1-1
*Elset, elset=Force, instance=Part-1-1, generate
*Elset, elset=Heat, instance=Part-1-1
*Nset, nset=Set-2, instance=Part-1-1
*Elset, elset=Set-2, instance=Part-1-1, generate
*Nset, nset=Set-6, instance=Part-1-1
*Elset, elset=Set-6, instance=Part-1-1, generate
*Nset, nset=Set-15, instance=Part-1-1
*Elset, elset=Set-15, instance=Part-1-1, generate
*Nset, nset=Set-17, instance=Part-1-1
*Elset, elset=Set-17, instance=Part-1-1
*Nset, nset=Set-22, instance=Part-1-1
*Elset, elset=Set-22, instance=Part-1-1
*Nset, nset=Set-24, instance=Part-1-1, generate
*Elset, elset=Set-24, instance=Part-1-1, generate
*Nset, nset=Set-26, instance=Part-1-1
*Elset, elset=Set-26, instance=Part-1-1
*Nset, nset=Set-27, instance=Part-1-1
*Elset, elset=Set-27, instance=Part-1-1, generate
*Nset, nset=Set-32, instance=Part-1-1
*Elset, elset=Set-32, instance=Part-1-1
*Nset, nset=disp, instance=Part-1-1
*Elset, elset=stressOut, instance=Part-1-1
*Elset, elset=_Surf-1_S4, internal, instance=Part-1-1, generate
*Elset, elset=_Surf-1_S2, internal, instance=Part-1-1
*Elset, elset=_Surf-1_S1, internal, instance=Part-1-1, generate
*Surface, type=ELEMENT, name=Surf-1
_Surf-1_S4, S4
_Surf-1_S2, S2
_Surf-1_S1, S1
*Elset, elset=_s_Surf-2_S2, internal, instance=Part-1-1
*Elset, elset=_s_Surf-2_S1, internal, instance=Part-1-1, generate
*Surface, type=ELEMENT, name=s_Surf-2
_s_Surf-2_S2, S2
_s_Surf-2_S1, S1
*End Assembly
**
** ELEMENT CONTROLS
**
*Section Controls, name=EC-1, hourglass=ENHANCED
*Amplitude, name=Amp-1, time=TOTAL TIME
             0.,              0.,           1125.,              1.
*Amplitude, name=Amp-2, definition=SMOOTH STEP
             0.,              0.,             10.,              1.,           1210.,              1.
*Amplitude, name=AmpCYL, definition=USER, variables=4
*Amplitude, name=AmpLU, definition=USER, variables=4
*Amplitude, name=AmpUA, definition=USER, variables=0
**
** MATERIALS
**
*Material, name=Material-1
*Density
 9.22e-10,
*Depvar
*User Defined Field
*User Material, constants=31, type=MECHANICAL, unsymm
*User Material, constants=2, type=THERMAL, unsymm
**
** PREDEFINED FIELDS
**
** Name: Predefined Field-1   Type: Temperature
*Initial Conditions, type=TEMPERATURE
Set-24, 298.15
** ----------------------------------------------------------------
**
** STEP: Step-1
**
*Step, name=Step-1, nlgeom=YES, inc=200000
*Coupled Temperature-displacement, creep=none, deltmx=0.33
0.0001, 5.0, 1e-08, 0.033
**
** BOUNDARY CONDITIONS
**
** Name: BC-2 Type: Velocity/Angular velocity
*Boundary, type=VELOCITY
Set-26, 1, 1
Set-26, 6, 6
** Name: BC-3 Type: Velocity/Angular velocity
*Boundary, type=VELOCITY
Set-27, 2, 2
Set-27, 6, 6
** Name: BC-4 Type: Velocity/Angular velocity
*Boundary, type=VELOCITY
Set-32, 2, 2, 0.2
**
** INTERACTIONS
**
** Interaction: Int-1
*Sfilm
Surf-1, F, 298.15, 0.021
**
** CONTROLS
**
*Controls, reset
**
** OUTPUT REQUESTS
**
*Restart, write, number interval=1, time marks=NO
**
** FIELD OUTPUT: F-Output-1
**
*Output, field
*Node Output
CF, RF, U
*Element Output, directions=YES
ER, EVOL, FV, LE, NFORCSO, PEMAG, S, SDV, SF, TEMP
*Contact Output
CSTRESS,
**
** FIELD OUTPUT: F-Output-2
**
*Output, field
*Node Output, nset=DiaRed
U,
**
** FIELD OUTPUT: F-Output-3
**
*Node Output, nset=Force
RF,
**
** FIELD OUTPUT: F-Output-5
**
*Node Output, nset=disp
U,
**
** FIELD OUTPUT: F-Output-4
**
*Element Output, elset=stressOut, directions=YES
LE,
**
** HISTORY OUTPUT: H-Output-1
**
*Output, history, variable=PRESELECT
*End Step
** ----------------------------------------------------------------
**
** STEP: Step-2
**
*Step, name=Step-2, nlgeom=YES, inc=10000000
*Coupled Temperature-displacement, creep=none, deltmx=0.33
0.0009, 95.0, 1e-06, 8.55
**
** BOUNDARY CONDITIONS
**
** Name: BC-4 Type: Velocity/Angular velocity
*Boundary, type=VELOCITY
Set-32, 2, 2, 0.2
**
** OUTPUT REQUESTS
**
*Restart, write, frequency=0
**
** FIELD OUTPUT: F-Output-1
**
*Output, field
*Node Output
CF, RF, U
*Element Output, directions=YES
ER, EVOL, FV, LE, NFORCSO, PEMAG, S, SDV, SF, TEMP
*Contact Output
CSTRESS,
**
** FIELD OUTPUT: F-Output-2
**
*Output, field
*Node Output, nset=DiaRed
U,
**
** FIELD OUTPUT: F-Output-3
**
*Node Output, nset=Force
RF,
**
** FIELD OUTPUT: F-Output-5
**
*Node Output, nset=disp
U,
**
** FIELD OUTPUT: F-Output-4
**
*Element Output, elset=stressOut, directions=YES
LE,
**
** HISTORY OUTPUT: H-Output-1
**
*Output, history, variable=PRESELECT
*End Step