*Heading
**Double notched specimen
**usage in conjunction with UMAT
** Generated by: Abaqus/CAE 6.14-2
*Preprint, echo=NO, model=NO, history=NO, contact=NO
**
** PARTS
**
*Part, name=Part-1
*End Part
**
**
** ASSEMBLY
**
*Assembly, name=Assembly
**
*Instance, name=Part-1-1, part=Part-1
*Node
*Element, type=CPE8RT
*Nset, nset=_PickedSet2, internal, generate
*Elset, elset=_PickedSet2, internal, generate
** Section: Section-1
*Solid Section, elset=_PickedSet2, material=Material-1
1.,
*End Instance
**
*Node
*Nset, nset=EQ, instance=Part-1-1
*Elset, elset=EQ, instance=Part-1-1
*Nset, nset=FEST, instance=Part-1-1
*Elset, elset=FEST, instance=Part-1-1
*Nset, nset=LAST, instance=Part-1-1
*Elset, elset=LAST, instance=Part-1-1
*Nset, nset=LOS, instance=Part-1-1
*Elset, elset=LOS, instance=Part-1-1
*Nset, nset=RP
*Nset, nset=_PickedSet10, internal, instance=Part-1-1, generate
*Elset, elset=_PickedSet10, internal, instance=Part-1-1, generate
** Constraint: Constraint-1
*Equation
EQ, 2, -1.
RP, 2, 1.
*End Assembly
**
** MATERIALS
**
*Material, name=Material-1
*Conductivity
 0.0625,
*Density
 7.85e-09,
*Depvar,delete=12
*Heat Generation
*User Material, constants=15, unsymm
**
** BOUNDARY CONDITIONS
**
** Name: BC-1 Type: Displacement/Rotation
*Boundary
FEST, 1, 1
FEST, 2, 2
** Name: BC-2 Type: Displacement/Rotation
*Boundary
LOS, 1, 1
**
** PREDEFINED FIELDS
**
** Name: Predefined Field-1   Type: Temperature
*Initial Conditions, type=TEMPERATURE
_PickedSet10, 0.
** ----------------------------------------------------------------
**
** STEP: Step-1
**
*Step, name=Step-1, nlgeom=YES, inc=5000
*Coupled Temperature-displacement, creep=none, steady state, stabilize, factor=0.0002, allsdtol=0.0, continue=NO
0.001, 1., 1e-14, 0.01
**
** BOUNDARY CONDITIONS
**
** Name: LAST Type: Displacement/Rotation
*Boundary
RP, 2, 2, 1.
**
** CONTROLS
**
*Controls, reset
*Controls, parameters=time incrementation
, , , , , 10, , 30, , ,
*Controls, parameters=field, field=displacement
0.002, 1., , , , , ,
*Controls, parameters=field, field=temperature
1.0, 1., , 1.875e-7, , , ,
**
** OUTPUT REQUESTS
**
*Restart, write, frequency=0
**
** FIELD OUTPUT: F-Output-1
*Output, field, frequency=200
*Node Output
NT, U
*Element Output, directions=YES
LE, S, SDV, STATUS
**
*Output, field, frequency=99999
*Node Output
NT, U
*Element Output, directions=YES
LE, S, SDV, STATUS
**
*Output, field, number interval=100, time marks=NO
*Node Output
NT, U
*Element Output, directions=YES
LE, S, SDV, STATUS
**
** HISTORY OUTPUT: H-Output-1
**
*Output, history
*Node Output, nset=RP
RF2, U2
*End Step