*Heading
** Shear band specimen
**Gradient-enhanced ductile damage law
**To be used in conjunction with UHARD
** Generated by: Abaqus/CAE 6.14-2
*Preprint, echo=NO, model=NO, history=NO, contact=NO
**
** PARTS
**
*Part, name=Part-1
*End Part
**
**
** ASSEMBLY
**
*Assembly, name=Assembly
**
*Instance, name=Part-1-1, part=Part-1
*Node
*Element, type=CPE8RT
*Nset, nset=_PickedSet2, internal, generate
*Elset, elset=_PickedSet2, internal, generate
** Section: Section-1
*Solid Section, elset=_PickedSet2, material=Material-1
1.,
*End Instance
**
*Node
*Nset, nset=BC, instance=Part-1-1
*Elset, elset=BC, instance=Part-1-1, generate
*Nset, nset=LAST, instance=Part-1-1
*Elset, elset=LAST, instance=Part-1-1, generate
*Nset, nset=RP
*Nset, nset=_PickedSet20, internal, instance=Part-1-1
*Elset, elset=_PickedSet20, internal, instance=Part-1-1, generate
*Nset, nset=_PickedSet23, internal, instance=Part-1-1, generate
*Elset, elset=_PickedSet23, internal, instance=Part-1-1, generate
** Constraint: Constraint-1
*Equation
LAST, 2, -1.
RP, 2, 1.
*End Assembly
**
** MATERIALS
**
*Material, name=Material-1
*Conductivity
 0.25,
*Density
 7.85e-09,
*Depvar
*Heat Generation
*Elastic
525., 0.3
*Plastic, hardening=USER, properties=4
1., 0.75,   0.,  0.4
**
** BOUNDARY CONDITIONS
**
** Name: BC-1 Type: Displacement/Rotation
*Boundary
BC, 1, 1
BC, 2, 2
** ----------------------------------------------------------------
**
** STEP: Step-1
**
*Step, name=Step-1, nlgeom=YES, inc=1000
*Coupled Temperature-displacement, creep=none, steady state
0.001, 1., 1e-12, 0.002
**
** BOUNDARY CONDITIONS
*Controls, reset
*Controls, parameters=time incrementation
, , , , , 10, , 10, , ,
*Controls, parameters=field, field=displacement
0.002, 1., , , , , ,
*Controls, parameters=field, field=temperature
1.0, 1., , 7.5e-7, , , ,
**
** Name: Last Type: Displacement/Rotation
*Boundary
RP, 1, 1
RP, 2, 2, 0.655
**
** OUTPUT REQUESTS
**
*Restart, write, frequency=0
**
** FIELD OUTPUT: F-Output-1
*Output, field, frequency=99999
*Node Output
NT, U
*Element Output, directions=YES
LE, S, SDV
**
*Output, field, number interval=10, time marks=NO
*Node Output
NT, U
*Element Output, directions=YES
LE, S, SDV
**
** HISTORY OUTPUT: H-Output-1
**
*Output, history
*Node Output, nset=RP
RF2, U2
*End Step